{"text_format":"3","workbook":"xlsx","n_sheets":14,"sheets":["SRG Calculator","Round Elbows","Rectangular Elbows","Round Duct Data","Rectangular Duct Data","Round Transitions","Rectangular Transitions","Standard Sizes","Table Format","Diagrams","Air Density Factors","User Manual","Example","memory"],"not_rendered":{"images":75,"macros":1,"external_links":1,"defined_names":4},"read":"whole","date_system":"1900"}

{"sheet":"SRG Calculator","index":0,"n_rows":37,"n_cols":18,"rows_kept":37,"merged":[[2,5,3,5],[2,6,3,11],[2,14,2,15],[3,14,3,15],[17,1,17,17],[18,1,18,7],[18,8,18,14],[18,15,18,17]]}
[]
[]
[{"$nulls":5},"Project Name:",{"$nulls":7},"Prepared By:"]
[{"$nulls":13},"Date:",{"$f":"TODAY()","v":"2020-01-30"}]
[]
[{"$nulls":3},"Units:",1,null,null,"Unit Design Supply Temp:",69,{"$f":"IF($E$6=2,\"°C\",\"°F\")","v":"°F"},{"$nulls":4},"For Your Records…"]
[{"$nulls":7},"Altitude:",0,{"$f":"IF($E$6=2,\"m\",\"ft\")","v":"ft"},"Duct Material Roughness:",{"v":0.00049,"d":"0.000490"},{"$f":"IF($E$6=2,\"m\",\"ft\")","v":"ft"},null,"Void Temp:",null,{"$f":"IF($E$6=2,\"°C\",\"°F\")","v":"°F"}]
[{"$nulls":7},"Supply Air Density =",{"v":0.07482936,"d":"0.07483"},{"$f":"IF($E$6=2,\"kg/m^3\",\"lbm/ft^3\")","v":"lbm/ft^3"}]
[{"$nulls":14},"Room Design Temp:",null,{"$f":"IF($E$6=2,\"°C\",\"°F\")","v":"°F"}]
[{"$nulls":7},"Design Static Pressure:",0.22,null,"Total Duct Pressure at Start:",0.3,{"$f":"IF($E$6=2,\"Pa\",\"inWC\")","v":"inWC"}]
[{"$nulls":7},"Tolerance %:",{"v":0.1,"d":"10%"},{"$nulls":5},"Insulation Thickness:",null,{"$f":"IF($E$6=2,\"mm\",\"in\")","v":"in"}]
[null,null,"Version 1.02"]
[]
[]
[]
{"$rows_left_out":23}
{"sheet":"Round Elbows","index":1,"n_rows":120,"n_cols":3,"rows_kept":120,"hidden":true}
[null,"Duct Dia (in.)","Loss Coefficient (Co)"]
["CD3-1",4,0.21]
["CD3-1",5,0.16]
["CD3-1",6,0.14]
["CD3-1",8,0.11]
["CD3-1",10,0.11]
["CD3-2",4,0.37]
["CD3-2",5,0.3]
["CD3-2",6,0.25]
["CD3-2",8,0.24]
["CD3-2",10,0.11]
["CD3-3",4,0.13]
["CD3-3",5,0.1]
["CD3-3",6,0.08]
["CD3-3",8,0.07]
{"$rows_left_out":106}
{"sheet":"Rectangular Elbows","index":2,"n_rows":58,"n_cols":15,"rows_kept":58,"hidden":true,"merged":[[0,2,0,14]]}
[null,null,"Duct Width (in.)"]
[null,"Duct Height (in.)",4,6,8,10,12,14,16,18,20,22,24,26,28]
["CR3-1",4,0.17,0.19,0.2,0.21,0.21,0.22,0.22]
["CR3-1",6,0.15,0.17,0.19,0.2,0.2,0.21,0.21,0.21,0.22,0.22,0.22]
["CR3-1",8,0.14,0.16,0.17,0.19,0.19,0.2,0.2,0.2,0.21,0.21,0.21,0.22,0.22]
["CR3-1",10,0.14,0.15,0.16,0.17,0.18,0.19,0.2,0.2,0.2,0.2,0.21,0.21,0.21]
["CR3-1",12,0.14,0.14,0.15,0.16,0.17,0.18,0.19,0.19,0.2,0.2,0.2,0.2,0.21]
["CR3-1",14,0.15,0.14,0.15,0.15,0.16,0.17,0.18,0.19,0.19,0.19,0.2,0.2,0.2]
["CR3-1",16,0.15,0.14,0.14,0.15,0.16,0.16,0.17,0.18,0.19,0.19,0.19,0.2,0.2]
["CR3-1",18,0.16,0.14,0.14,0.14,0.15,0.16,0.17,0.17,0.18,0.18,0.19,0.19,0.19]
["CR3-6",4,1.18,1.24,1.27,1.28,1.29,1.3,1.3]
["CR3-6",6,1.13,1.18,1.23,1.25,1.27,1.28,1.29,1.29,1.29,1.3,1.3]
["CR3-6",8,1.07,1.15,1.18,1.22,1.24,1.26,1.27,1.28,1.28,1.29,1.29,1.29,1.3]
["CR3-6",10,1.03,1.11,1.16,1.18,1.21,1.24,1.25,1.26,1.27,1.28,1.28,1.28,1.29]
["CR3-6",12,0.98,1.07,1.13,1.16,1.18,1.21,1.23,1.24,1.25,1.26,1.27,1.27,1.28]
{"$rows_left_out":44}
{"sheet":"Round Duct Data","index":3,"n_rows":16,"n_cols":21,"rows_kept":16,"hidden":true,"merged":[[0,2,0,12],[0,13,0,20]]}
[null,null,"from SRG",{"$nulls":10},"from table"]
["type","instruction","label (1st variable)","Directionality (0 for 1st vertical, 1 for horizontal, 2 for 2nd vertical)","column ","label (2nd variable on table for 2D and 3D)","Directionality (0 for 1st vertical, 1 for horizontal, 2 for 2nd vertical)","column ","row  offset (how offset from x row)","abel (3rd variable on table for 3D)","Directionality (0 for 1st vertical, 1 for horizontal, 2 for 2nd vertical)","column ","row offset (how offset from x row)","data sheet name","dimention","horizontal variable row (for 2D)","data starting row","fitting column","1st vertical variable column","2nd vertical veriable column (for 3D)","data starting column"]
["CD3-1","Elbow, Die Stamped, 90 Degree, r/D = 1.5","Diameter",0,5,{"$nulls":8},"Round Elbows",1,null,2,1,2,null,3]
["CD3-2","Elbow, Die Stamped, 90 Degree, r/D = 1.0","Diameter",0,5,{"$nulls":8},"Round Elbows",1,null,2,1,2,null,3]
["CD3-3","Elbow, Die Stamped, 45 Degree, r/D = 1.5","Diameter",0,5,{"$nulls":8},"Round Elbows",1,null,2,1,2,null,3]
["CD3-4","Elbow, Die Stamped, 45 Degree, r/D = 1.0","Diameter",0,5,{"$nulls":8},"Round Elbows",1,null,2,1,2,null,3]
["CD3-5","Elbow, Pleated, 90 Degree, r/D = 1.5","Diameter",0,5,{"$nulls":8},"Round Elbows",1,null,2,1,2,null,3]
["CD3-7","Elbow, Pleated, 45 Degree, r/D = 1.5","Diameter",0,5,{"$nulls":8},"Round Elbows",1,null,2,1,2,null,3]
["CD3-15","Elbow, Mitered, 90 Degree","Diameter",0,5,{"$nulls":8},"Round Elbows",1,null,2,1,2,null,3]
["CD3-16","Elbow, Mitered, 60 Degree","Diameter",0,5,{"$nulls":8},"Round Elbows",1,null,2,1,2,null,3]
["CD3-17","Elbow, Mitered, 45 Degree","Diameter",0,5,{"$nulls":8},"Round Elbows",1,null,2,1,2,null,3]
["CD3-18","Elbow, Mitered, 30 Degree","Diameter",0,5,{"$nulls":8},"Round Elbows",1,null,2,1,2,null,3]
["CD3-19","Elbow, Mitered, 22.5 Degree","Diameter",0,5,{"$nulls":8},"Round Elbows",1,null,2,1,2,null,3]
["CD3-20","Elbow, Mitered with Vanes, 90 Degree","Diameter",0,5,{"$nulls":8},"Round Elbows",1,null,2,1,2,null,3]
["SD4-1-30","Transition, Round to Round, Supply Air Systems - 30 Degree Angle","Diameter 1",1,5,"Diameter 0",0,5,1,{"$nulls":4},"Round Transitions",2,2,3,1,2,null,3]
{"$rows_left_out":2}
{"sheet":"Rectangular Duct Data","index":4,"n_rows":11,"n_cols":21,"rows_kept":11,"hidden":true,"merged":[[0,2,0,12],[0,13,0,20]]}
[null,null,"from SRG",{"$nulls":10},"from table"]
["fitname","instruction","label (1st variable)","Directionality (0 for 1st vertical, 1 for horizontal, 2 for 2nd vertical)","column ","label (2nd variable on table for 2D and 3D)","Directionality (0 for 1st vertical, 1 for horizontal, 2 for 2nd vertical)","column ","row  offset (how offset from x row)","abel (3rd variable on table for 3D)","Directionality (0 for 1st vertical, 1 for horizontal, 2 for 2nd vertical)","column ","row offset (how offset from x row)","data sheet name","dimention","horizontal variable row (for 2D)","data starting row","fitting column","1st vertical variable column","2nd vertical veriable column (for 3D)","data starting column"]
["CR3-1","Elbow, Smooth Radius without Vanes, 1.5 RR, 90 degrees","Width",0,5,"Height",1,6,0,{"$nulls":4},"Rectangular Elbows",2,2,3,1,2,null,3]
["CR3-6","Elbow, Mitered, 90 Degrees, Without Vanes","Width",0,5,"Height",1,6,0,{"$nulls":4},"Rectangular Elbows",2,2,3,1,2,null,3]
["CR3-9","Elbow, Mitered, 90 Degree, Single-Thickness Vanes, 1 1/2-in. Vane Spacing ","Width",0,5,"Height",1,6,0,{"$nulls":4},"Rectangular Elbows",2,2,3,1,2,null,3]
["CR3-12","Elbow, Mitered, 90 Degree, Single-Thickness Vanes, 3 1/4-in. Vane Spacing","Width",0,5,"Height",1,6,0,{"$nulls":4},"Rectangular Elbows",2,2,3,1,2,null,3]
["CR3-14","Elbow, Mitered, 90 Degree, Double-Thickness Vanes, 1 1/2-in. Vane Spacing","Width",0,5,"Height",1,6,0,{"$nulls":4},"Rectangular Elbows",2,2,3,1,2,null,3]
["CR3-15","Elbow, Mitered, 90 Degree, Double-Thickness Vanes, 2 1/8-in. Vane Spacing","Width",0,5,"Height",1,6,0,{"$nulls":4},"Rectangular Elbows",2,2,3,1,2,null,3]
["CR3-16","Elbow, Mitered, 90 Degree, Double-Thickness Vanes, 3 1/4-in. Vane Spacing","Width",0,5,"Height",1,6,0,{"$nulls":4},"Rectangular Elbows",2,2,3,1,2,null,3]
["SR4-1-30","Transition, Rectangular, Two Sides Parallel, Symmetrical, Supply Air Systems - 30 degree angle","Height 1",2,6,"Width",0,5,0,"Height 0",1,6,1,"Rectangular Transitions",3,2,3,1,2,3,4]
["SR4-1-45","Transition, Rectangular, Two Sides Parallel, Symmetrical, Supply Air Systems - 45 degree angle","Height 1",2,6,"Width",0,5,0,"Height 0",1,6,1,"Rectangular Transitions",3,2,3,1,2,3,4]

{"sheet":"Round Transitions","index":5,"n_rows":30,"n_cols":16,"rows_kept":30,"hidden":true,"merged":[[0,2,0,15]]}
[null,null,"D1 Larger dimension"]
[null,"Do",4,5,6,8,10,12,14,16,18,20,22,24,26,28]
["SD4-1-30",4,0,0.1,0.25,0.64,1.63,3.92]
["SD4-1-30",5,null,0,0.07,0.33,0.64,1.33,2.9]
["SD4-1-30",6,null,null,0,0.14,0.37,0.65,1.19,2.28]
["SD4-1-30",8,{"$nulls":3},0,0.1,0.28,0.43,0.64,1.06,1.63]
["SD4-1-30",10,{"$nulls":4},0,0.07,0.19,0.33,0.46,0.66,0.94,1.38]
["SD4-1-30",12,{"$nulls":5},0,0.05,0.14,0.25,0.37,0.5,0.65,0.89]
["SD4-1-30",14,{"$nulls":6},0,0.04,0.12,0.21,0.3,0.41,0.52,0.64]
["SD4-1-30",16,{"$nulls":7},0,0.04,0.1,0.17,0.25,0.35,0.43]
["SD4-1-30",18,{"$nulls":8},0,0.03,0.08,0.14,0.22,0.3]
["SD4-1-30",20,{"$nulls":9},0,0.03,0.07,0.12,0.19]
["SD4-1-30",22,{"$nulls":10},0,0.03,0.06,0.11]
["SD4-1-30",24,{"$nulls":11},0,0.02,0.05]
["SD4-1-30",26,{"$nulls":12},0,0.02]
{"$rows_left_out":16}
{"sheet":"Rectangular Transitions","index":6,"n_rows":354,"n_cols":14,"rows_kept":354,"hidden":true,"merged":[[0,3,0,13],[2,22,2,32]]}
[{"$nulls":3},"Ho"]
[null,"W","H1",4,6,8,10,12,14,16,18,20,22,24]
["SR4-1-30",6,6,0.06]
["SR4-1-30",6,8,0.16,0.04]
["SR4-1-30",6,10,0.25,0.09,0.03]
["SR4-1-30",6,12,0.36,0.16,0.06,0.02]
["SR4-1-30",6,14,0.49,0.22,0.11,0.05,0.02]
["SR4-1-30",6,16,null,0.29,0.16,0.08,0.04,0.01]
["SR4-1-30",6,18,null,0.37,0.21,0.12,0.06,0.03,0.01]
["SR4-1-30",6,20,null,null,0.25,0.16,0.09,0.05,0.02,0.01]
["SR4-1-30",6,22,{"$nulls":3},0.2,0.13,0.07,0.04,0.02,0.01]
["SR4-1-30",6,24,{"$nulls":3},0.23,0.16,0.1,0.06,0.04,0.02,0.01]
["SR4-1-30",6,26,{"$nulls":4},0.19,0.13,0.08,0.05,0.03,0.02,0.01]
["SR4-1-30",8,6,0.06]
["SR4-1-30",8,8,0.16,0.04]
{"$rows_left_out":340}
{"sheet":"Standard Sizes","index":7,"n_rows":17,"n_cols":7,"rows_kept":17,"hidden":true,"merged":[[2,1,2,2],[2,5,2,6]]}
[]
[]
[null,"IP Units",{"$nulls":3},"SI Units"]
[null,"W","H",null,null,"W","H"]
[null,6,6,null,null,200,100]
[null,8,8,null,null,250,150]
[null,10,10,null,null,300,200]
[null,12,12,null,null,400,250]
[null,14,14,null,null,500,300]
[null,16,16,null,null,600,400]
[null,18,18,null,null,800,500]
[null,20,{"$nulls":3},1000,600]
[null,22,{"$nulls":3},1200,800]
[null,24,{"$nulls":3},1400,1000]
[null,26,{"$nulls":3},1600,1200]
{"$rows_left_out":3}
{"sheet":"Table Format","index":8,"n_rows":200,"n_cols":18,"rows_kept":200,"hidden":true,"merged":[[3,1,3,17],[4,1,4,7],[4,8,4,14],[4,15,4,17]]}
[]
[]
[{"$nulls":3},"Parent Branch"]
[null,"Static Pressure Calculation"]
[null,"Duct Parameter Inputs (Select From Dropdowns)",{"$nulls":6},"Calculations",{"$nulls":6},"Results"]
[null,"Section Number","Duct Length","Vol. Flow Rate","Duct Width/Diameter","Duct Height","Duct Fitting","Duct Fitting instruction","Equiv. Diameter","ASHRAE Loss Coefficient","Duct Area","Total Volumetric Flow","Duct Velocity","Fitting Loss","Friction Loss","Total Pressure","Velocity Pressure","Static Pressure"]
[null,null,{"$f":"IF($E$6=2,\"m\",\"ft\")","v":"ft"},{"$f":"IF($E$6=2,\"l/s\",\"CFM\")","v":"CFM"},{"$f":"IF($E$6=2,\"mm\",\"in\")","v":"in"},{"$f":"IF($E$6=2,\"mm\",\"in\")","v":"in"},null,null,{"$f":"IF($E$6=2,\"m\",\"ft\")","v":"ft"},null,{"$f":"IF($E$6=2,\"m^2\",\"ft^2\")","v":"ft^2"},{"$f":"IF($E$6=2,\"l/s\",\"CFM\")","v":"CFM"},{"$f":"IF($E$6=2,\"m/s\",\"ft/s\")","v":"ft/s"},{"$f":"IF($E$6=2,\"Pa\",\"inWC\")","v":"inWC"},{"$f":"IF($E$6=2,\"Pa\",\"inWC\")","v":"inWC"},{"$f":"IF($E$6=2,\"Pa\",\"inWC\")","v":"inWC"},{"$f":"IF($E$6=2,\"Pa\",\"inWC\")","v":"inWC"},{"$f":"IF($E$6=2,\"Pa\",\"inWC\")","v":"inWC"}]
[null,null,{"$f":"SUM(C9:C23)","v":0},{"$f":"SUM(D9:D23)","v":0},null,null,"-","-",null,null,{"$f":"SUM(K9:K23)","v":{"v":0,"d":"0.00"}},{"$nulls":4},{"$f":"IF(INT(B9)=1,$L$10,IF(NOT(ISERROR(VLOOKUP(E3,B:P,15,FALSE))),VLOOKUP(E3,B:P,15,FALSE),\"\"))","v":""}]
[{"$nulls":7},{"$f":"IF(G9=\"\",\"\",IF(AND(E9<>\"\",F9<>\"\"),IFERROR(VLOOKUP(G9,OFFSET('Rectangular Duct Data'!$A$2,0,0,COUNTA('Round Duct Data'!C:C),2),2,FALSE),\"\"),IFERROR(VLOOKUP(G9,OFFSET('Round Duct Data'!$A$3,0,0,COUNTA('Round Duct Data'!A:A),2),2,FALSE),\"\")))","v":""},{"$f":"IF(E9<>\"\",IF(F9=\"\",IF($E$6=2,E9/1000,E9),IF($E$6=2,(1.3*POWER((E9*F9),0.625)/POWER((E9+F9),0.25))/1000,(1.3*POWER((E9*F9),0.625)/POWER((E9+F9),0.25)))),\"\")","v":""},null,{"$f":"IF(I9<>\"\",IF(F9<>\"\",IF($E$6=1,(E9/12)*(F9/12),(E9/1000)*(F9/1000)),IF($E$6=1,PI()*0.25*(I9/12)^2,PI()*0.25*(I9)^2)),\"\")","v":""},{"$f":"IF(D8=0,\"\",D8)","v":""},{"$f":"IF(K9<>\"\",IF($E$6=2,L9/(ROUND(K9*(1000),1)),ROUND(L9/(K9),1)),\"\")","v":""},{"$f":"IF(M9=\"\",\"\",IF($E$6=2,0.5*J9*$I$8*M9^2,((0.5*J9*$I$8*(M9/60)^2)/32.174)/5.1971))","v":""},{"$f":"IF(M9<>\"\",IF($E$6=2,(0.109136*POWER((L9/1000),1.9))/(POWER(I9,5.02))*C9*($L$7*1000),0.11*(((12*$L$7)/I9)+(68/(8.56*I9*M9)))^0.25*((12*C9)/I9)*Q9),\"\")","v":""},{"$f":"IF(N9<>\"\",P8-N9-O9,\"\")","v":""},{"$f":"IF(M9=\"\",\"\",IF($E$6=2,0.5*$I$8*M9^2,(0.5*$I$8*(M9/60)^2)/(32.174*5.1971)))","v":""},{"$f":"IF(P9<>\"\",P9-Q9,\"\")","v":""}]
[{"$nulls":7},{"$f":"IF(G10=\"\",\"\",IF(AND(E10<>\"\",F10<>\"\"),IFERROR(VLOOKUP(G10,OFFSET('Rectangular Duct Data'!$A$2,0,0,COUNTA('Round Duct Data'!C:C),2),2,FALSE),\"\"),IFERROR(VLOOKUP(G10,OFFSET('Round Duct Data'!$A$3,0,0,COUNTA('Round Duct Data'!A:A),2),2,FALSE),\"\")))","v":""},{"$f":"IF(E10<>\"\",IF(F10=\"\",IF($E$6=2,E10/1000,E10),IF($E$6=2,(1.3*POWER((E10*F10),0.625)/POWER((E10+F10),0.25))/1000,(1.3*POWER((E10*F10),0.625)/POWER((E10+F10),0.25)))),\"\")","v":""},null,{"$f":"IF(I10<>\"\",IF(F10<>\"\",IF($E$6=1,(E10/12)*(F10/12),(E10/1000)*(F10/1000)),IF($E$6=1,PI()*0.25*(I10/12)^2,PI()*0.25*(I10)^2)),\"\")","v":""},{"$f":"IF(AND(D10=0,E10=0),\"\",L9-D9)","v":""},{"$f":"IF(K10<>\"\",IF($E$6=2,L10/(ROUND(K10*(1000),1)),ROUND(L10/(K10),)),\"\")","v":""},{"$f":"IF(M10=\"\",\"\",IF($E$6=2,0.5*J10*$I$8*M10^2,((0.5*J10*$I$8*(M10/60)^2)/32.174)/5.1971))","v":""},{"$f":"IF(M10<>\"\",IF($E$6=2,(0.109136*POWER((L10/1000),1.9))/(POWER(I10,5.02))*C10*($L$7*1000),0.11*(((12*$L$7)/I10)+(68/(8.56*I10*M10)))^0.25*((12*C10)/I10)*Q10),\"\")","v":""},{"$f":"IF(N10<>\"\",P9-N10-O10,\"\")","v":""},{"$f":"IF(M10=\"\",\"\",IF($E$6=2,0.5*$I$8*M10^2,(0.5*$I$8*(M10/60)^2)/(32.174*5.1971)))","v":""},{"$f":"IF(Q10=\"\",\"\",P10-Q10)","v":""}]
[{"$nulls":7},{"$f":"IF(G11=\"\",\"\",IF(AND(E11<>\"\",F11<>\"\"),IFERROR(VLOOKUP(G11,OFFSET('Rectangular Duct Data'!$A$2,0,0,COUNTA('Round Duct Data'!C:C),2),2,FALSE),\"\"),IFERROR(VLOOKUP(G11,OFFSET('Round Duct Data'!$A$3,0,0,COUNTA('Round Duct Data'!A:A),2),2,FALSE),\"\")))","v":""},{"$f":"IF(E11<>\"\",IF(F11=\"\",IF($E$6=2,E11/1000,E11),IF($E$6=2,(1.3*POWER((E11*F11),0.625)/POWER((E11+F11),0.25))/1000,(1.3*POWER((E11*F11),0.625)/POWER((E11+F11),0.25)))),\"\")","v":""},null,{"$f":"IF(I11<>\"\",IF(F11<>\"\",IF($E$6=1,(E11/12)*(F11/12),(E11/1000)*(F11/1000)),IF($E$6=1,PI()*0.25*(I11/12)^2,PI()*0.25*(I11)^2)),\"\")","v":""},{"$f":"IF(AND(D11=0,E11=0),\"\",L10-D10)","v":""},{"$f":"IF(K11<>\"\",IF($E$6=2,L11/(ROUND(K11*(1000),1)),ROUND(L11/(K11),)),\"\")","v":""},{"$f":"IF(M11=\"\",\"\",IF($E$6=2,0.5*J11*$I$8*M11^2,((0.5*J11*$I$8*(M11/60)^2)/32.174)/5.1971))","v":""},{"$f":"IF(M11<>\"\",IF($E$6=2,(0.109136*POWER((L11/1000),1.9))/(POWER(I11,5.02))*C11*($L$7*1000),0.11*(((12*$L$7)/I11)+(68/(8.56*I11*M11)))^0.25*((12*C11)/I11)*Q11),\"\")","v":""},"",{"$f":"IF(M11=\"\",\"\",IF($E$6=2,0.5*$I$8*M11^2,(0.5*$I$8*(M11/60)^2)/(32.174*5.1971)))","v":""},{"$f":"IF(Q11=\"\",\"\",P11-Q11)","v":""}]
[{"$nulls":7},{"$f":"IF(G12=\"\",\"\",IF(AND(E12<>\"\",F12<>\"\"),IFERROR(VLOOKUP(G12,OFFSET('Rectangular Duct Data'!$A$2,0,0,COUNTA('Round Duct Data'!C:C),2),2,FALSE),\"\"),IFERROR(VLOOKUP(G12,OFFSET('Round Duct Data'!$A$3,0,0,COUNTA('Round Duct Data'!A:A),2),2,FALSE),\"\")))","v":""},{"$f":"IF(E12<>\"\",IF(F12=\"\",IF($E$6=2,E12/1000,E12),IF($E$6=2,(1.3*POWER((E12*F12),0.625)/POWER((E12+F12),0.25))/1000,(1.3*POWER((E12*F12),0.625)/POWER((E12+F12),0.25)))),\"\")","v":""},null,{"$f":"IF(I12<>\"\",IF(F12<>\"\",IF($E$6=1,(E12/12)*(F12/12),(E12/1000)*(F12/1000)),IF($E$6=1,PI()*0.25*(I12/12)^2,PI()*0.25*(I12)^2)),\"\")","v":""},"","",{"$f":"IF(M12=\"\",\"\",IF($E$6=2,0.5*J12*$I$8*M12^2,((0.5*J12*$I$8*(M12/60)^2)/32.174)/5.1971))","v":""},{"$f":"IF(M12<>\"\",IF($E$6=2,(0.109136*POWER((L12/1000),1.9))/(POWER(I12,5.02))*C12*($L$7*1000),0.11*(((12*$L$7)/I12)+(68/(8.56*I12*M12)))^0.25*((12*C12)/I12)*Q12),\"\")","v":""},"",{"$f":"IF(M12=\"\",\"\",IF($E$6=2,0.5*$I$8*M12^2,(0.5*$I$8*(M12/60)^2)/(32.174*5.1971)))","v":""},{"$f":"IF(Q12=\"\",\"\",P12-Q12)","v":""}]
[{"$nulls":7},{"$f":"IF(G13=\"\",\"\",IF(AND(E13<>\"\",F13<>\"\"),IFERROR(VLOOKUP(G13,OFFSET('Rectangular Duct Data'!$A$2,0,0,COUNTA('Round Duct Data'!C:C),2),2,FALSE),\"\"),IFERROR(VLOOKUP(G13,OFFSET('Round Duct Data'!$A$3,0,0,COUNTA('Round Duct Data'!A:A),2),2,FALSE),\"\")))","v":""},{"$f":"IF(E13<>\"\",IF(F13=\"\",IF($E$6=2,E13/1000,E13),IF($E$6=2,(1.3*POWER((E13*F13),0.625)/POWER((E13+F13),0.25))/1000,(1.3*POWER((E13*F13),0.625)/POWER((E13+F13),0.25)))),\"\")","v":""},null,{"$f":"IF(I13<>\"\",IF(F13<>\"\",IF($E$6=1,(E13/12)*(F13/12),(E13/1000)*(F13/1000)),IF($E$6=1,PI()*0.25*(I13/12)^2,PI()*0.25*(I13)^2)),\"\")","v":""},"","",{"$f":"IF(M13=\"\",\"\",IF($E$6=2,0.5*J13*$I$8*M13^2,((0.5*J13*$I$8*(M13/60)^2)/32.174)/5.1971))","v":""},{"$f":"IF(M13<>\"\",IF($E$6=2,(0.109136*POWER((L13/1000),1.9))/(POWER(I13,5.02))*C13*($L$7*1000),0.11*(((12*$L$7)/I13)+(68/(8.56*I13*M13)))^0.25*((12*C13)/I13)*Q13),\"\")","v":""},"",{"$f":"IF(M13=\"\",\"\",IF($E$6=2,0.5*$I$8*M13^2,(0.5*$I$8*(M13/60)^2)/(32.174*5.1971)))","v":""},{"$f":"IF(Q13=\"\",\"\",P13-Q13)","v":""}]
[{"$nulls":7},{"$f":"IF(G14=\"\",\"\",IF(AND(E14<>\"\",F14<>\"\"),IFERROR(VLOOKUP(G14,OFFSET('Rectangular Duct Data'!$A$2,0,0,COUNTA('Round Duct Data'!C:C),2),2,FALSE),\"\"),IFERROR(VLOOKUP(G14,OFFSET('Round Duct Data'!$A$3,0,0,COUNTA('Round Duct Data'!A:A),2),2,FALSE),\"\")))","v":""},"",null,"","","","","","","",""]
[{"$nulls":7},{"$f":"IF(G15=\"\",\"\",IF(AND(E15<>\"\",F15<>\"\"),IFERROR(VLOOKUP(G15,OFFSET('Rectangular Duct Data'!$A$2,0,0,COUNTA('Round Duct Data'!C:C),2),2,FALSE),\"\"),IFERROR(VLOOKUP(G15,OFFSET('Round Duct Data'!$A$3,0,0,COUNTA('Round Duct Data'!A:A),2),2,FALSE),\"\")))","v":""},"",null,"","","","","","","",""]
{"$rows_left_out":186}
{"sheet":"Diagrams","index":9,"n_rows":22,"n_cols":4,"rows_kept":22,"hidden":true}
[null,"Diagram","Code","Description"]
[null,null,"CD3-1","Elbow, Die Stamped, 90 Degree, r/D=1.5"]
[null,null,"CD3-2","Elbow, Die Stamped, 90 Degree, r/D=1.0"]
[null,null,"CD3-3","Elbow, Die Stamped, 45 Degree, r/D = 1.5"]
[null,null,"CD3-4","Elbow, Die Stamped, 45 Degree, r/D = 1.0"]
[null,null,"CD3-5","Elbow, Pleated, 90 Degree, r/D = 1.5"]
[null,null,"CD3-7","Elbow, Pleated, 45 Degree, r/D = 1.5"]
[null,null,"CD3-15","Elbow, Mitered, 90 Degree"]
[null,null,"CD3-18","Elbow, Mitered, 30 Degree"]
[null,null,"CD3-19","Elbow, Mitered, 22.5 Degree"]
[null,null,"CD3-20","Elbow, Mitered with Vanes, 90 Degree"]
[null,null,"CD3-16","Elbow, Mitered, 60 Degree"]
[null,null,"CD3-17","Elbow, Mitered, 45 Degree"]
[null,null,"CR3-1","Elbow, Smooth Radius without Vanes, 1.5RR, 90 degrees"]
[null,null,"CR3-6","Elbow, Mitered, 90 Degrees, Without Vanes"]
{"$rows_left_out":8}
{"sheet":"Air Density Factors","index":10,"n_rows":15,"n_cols":16,"rows_kept":15,"hidden":true,"merged":[[0,1,0,9],[1,2,1,9]]}
[null,"Air Density Correction Factor"]
[null,"Air Temp (°F)","Altitude (ft)"]
[null,null,0,1000,2000,3000,4000,5000,6000,7000,null,null,"standard air density",{"$f":"IF('SRG Calculator'!E6=1,0.07468,1.2)","v":{"v":0.07468,"d":"0.074680"}},{"$f":"'SRG Calculator'!J8","v":"lbm/ft^3"}]
["correction",50,1.04,{"v":1,"d":"1.00"},0.97,0.94,{"v":0.9,"d":"0.90"},0.87,0.84,0.81]
["correction",55,1.03,0.99,0.96,0.93,0.89,0.86,0.83,{"v":0.8,"d":"0.80"}]
["correction",60,1.02,0.98,0.95,0.91,0.88,0.85,0.82,0.79,{"$nulls":4},"Min","Max"]
["correction",70,{"v":1,"d":"1.00"},0.96,0.93,0.89,0.86,0.83,{"v":0.8,"d":"0.80"},0.77,null,null,"Duct Velocity Recommended Limits",null,{"$f":"IF('SRG Calculator'!E6=1,500,2.5)","v":500},{"$f":"IF('SRG Calculator'!E6=1,1500,8)","v":1500}]
["correction",80,0.99,0.95,0.92,0.88,0.85,0.81,0.79,0.76]
["correction",90,0.97,0.94,{"v":0.9,"d":"0.90"},0.86,0.83,{"v":0.8,"d":"0.80"},0.77,0.75]
["correction",100,0.95,0.93,0.88,0.85,0.81,0.78,0.75,0.73]
["correction",110,0.94,0.92,0.86,0.83,{"v":0.8,"d":"0.80"},0.77,0.74,0.72]
["correction",120,0.93,{"v":0.9,"d":"0.90"},0.85,0.82,0.79,0.76,0.73,0.71]
["correction",130,0.91,0.88,0.83,0.81,0.78,0.75,0.72,{"v":0.7,"d":"0.70"}]
["correction",140,0.89,0.86,0.81,{"v":0.8,"d":"0.80"},0.77,0.73,0.71,0.68]
["correction",150,0.87,0.84,{"v":0.8,"d":"0.80"},0.79,0.75,0.72,{"v":0.7,"d":"0.70"},0.67]
{"$rows_left_out":1}
{"sheet":"User Manual","index":11,"n_rows":223,"n_cols":2,"rows_kept":223}
["Static Regain Calculator User Manual"]
["Don't forget to Save periodically throughout your work to ensure you don't lose any progress."]
[]
[]
["A General Overview"]
[]
["Step 1:","Fill in entry boxes titled \"Project Name\" and \"Produced By\" accordingly. The date will automatically insert the current day but can be overridden if necessary."]
{"$rows_empty":8}
["Step 2: ","Select the button corresponding to the unit system you will be using to design the duct system (IP = English Units, SI = Metric Units). All units and calculation formulas will automatically update"]
[null,"to match the unit system selected. For this example, English (IP) units are used."]
{"$rows_empty":8}
["Step 3: ","Fill in the entry boxes titled \"Unit Design Supply Temp\" (The temperature of the air being supplied by the AHU) and \"Altitude\" (The distance above sea level that the AHU is at) accordingly.  "]
[null,"Make sure that the numbers correspond to the units located to the right of entry boxes. Once these numbers are entered, the spreadsheet will automatically calculate the Air Density Correction "]
[null,"Factor and then output a value next to the label titled \"Supply Air Density\" directly beneath the two entry boxes just filled in. For this example, a temperature of 69°F is used at sea level (0 ft)."]
{"$rows_empty":8}
{"$rows_left_out":60}
{"sheet":"Example","index":12,"n_rows":358,"n_cols":2,"rows_kept":358,"merged":[[3,1,3,19],[35,1,35,19],[68,1,68,19],[94,1,94,19],[125,1,125,19],[177,1,177,19],[208,1,208,19],[270,1,270,19],[337,1,337,19],[355,1,355,19]]}
[]
[]
[]
[null,"Step 1 - Sketch Layout"]
[]
[null,"Sketch a schematic of duct and diffuser layout, mark each diffuser with volume flow rate."]
{"$rows_empty":29}
[null,"Step 2 - Mark Up Sections with References"]
[]
[null,"Mark each section of the duct between diffusers and branches with a unique identifying number, starting with 1.01."]
[null,"Bends and takeoffs and any fitting must be marked up with a unique number. "]
[null,"Tip: Don’t worry if items are missed, they can be inserted later."]
{"$rows_empty":28}
[null,"Step 3 - Enter Duct Lengths and Diffuser Flow Rates"]
[]
{"$rows_left_out":56}
{"sheet":"memory","index":13,"n_rows":6,"n_cols":2,"rows_kept":6,"hidden":true}
[25,24]
[24,23]
[27,26]
[28,27]
[31,30]
[30,29]